Error al compilar

Todo lo relacionado con los entornos de escritorio, todas las aplicaciones, tanto KDE, Gnome y otros. Si tenes un problema con un programa, muy probablemente este sea el foro indicado.
jcampos1960
Archer
Archer
Mensajes: 33
Registrado: 27 Oct 2014, 10:58

Error al compilar

Mensajepor jcampos1960 » 11 Jun 2017, 01:52

Hola. Estoy intentando compilar una aplicación de calendario "california" y obtengo ERROR
*****************************************
Compilation failed: 0 error(s), 2 warning(s)
make[2]: *** [Makefile:4649: california_vala.stamp] Error 1
make[2]: se sale del directorio '/tmp/yaourt-tmp-jcampos/aur-california/src/california-0.4.0/src'
make[1]: *** [Makefile:561: all-recursive] Error 1
make[1]: se sale del directorio '/tmp/yaourt-tmp-jcampos/aur-california/src/california-0.4.0'
make: *** [Makefile:414: all] Error 2
==> ERROR: Se produjo un fallo en build().
Cancelando…
==> ERROR: Makepkg no ha podido compilar california.
*****************************************
Alguna Idea ?

Gracias

Juan desde ASTURIAS

Avatar de Usuario
sud_crow
Administrador
Administrador
Mensajes: 946
Registrado: 16 Abr 2005, 00:38
Ubicación: Buenos Aires - Argentina
Contactar:

Re: Error al compilar

Mensajepor sud_crow » 28 Jun 2017, 02:49

Hola!

Te falta toda la parte de los errores, eso es la salida unicamente.

Inserta desde donde comienzan y por favor usa los tags [ code ] y [ / code ] para el formato.
¿Revisaste la wiki? | ¿Usaste la función buscar del foro? | ¿Leíste las normas del foro?
Blog : | Correo+Jabber: leonardo @ archlinux-es.org

jcampos1960
Archer
Archer
Mensajes: 33
Registrado: 27 Oct 2014, 10:58

Re: Error al compilar

Mensajepor jcampos1960 » 28 Jun 2017, 09:25

****
............

Código: Seleccionar todo

 -D_FORTIFY_SOURCE=2 -DGETTEXT_PACKAGE=\""california"\" -DPREFIX=\"/usr\" -DSOURCE_ROOT_DIR=\"`cd ..; pwd`\"  -march=x86-64 -mtune=generic -O2 -pipe -fstack-protector-strong -MT california-california-resources.o -MD -MP -MF .deps/california-california-resources.Tpo -c -o california-california-resources.o `test -f 'california-resources.c' || echo './'`california-resources.c
application/california-application.vala:58.5-67.6: warning: the modifier `static' is not applicable to constants
host/host-main-window.vala:74.5-84.6: warning: the modifier `static' is not applicable to constants
mv -f .deps/california-california-resources.Tpo .deps/california-california-resources.Po
Compilation failed: 0 error(s), 2 warning(s)
make[2]: *** [Makefile:4649: california_vala.stamp] Error 1
make[2]: se sale del directorio '/tmp/yaourt-tmp-jcampos/aur-california/src/california-0.4.0/src'
make[1]: *** [Makefile:561: all-recursive] Error 1
make[1]: se sale del directorio '/tmp/yaourt-tmp-jcampos/aur-california/src/california-0.4.0'
make: *** [Makefile:414: all] Error 2
==> ERROR: Se produjo un fallo en build().
    Cancelando...
==> ERROR: Makepkg no ha podido compilar california.
=/=> ¿Reiniciar la compilación de california? [s/N]

Avatar de Usuario
icemodding
Archer
Archer
Mensajes: 46
Registrado: 05 Dic 2015, 01:10
Ubicación: Tucumán - Argentina
Contactar:

Re: Error al compilar

Mensajepor icemodding » 13 Ago 2017, 19:14

Pudiste compilar? Te fijaste si no era por falta de espacio en /tmp o editaste el pkbuild cuando te da la opción para hacer éso?


Volver a “Aplicaciones y Entornos de Escritorio”

¿Quién está conectado?

Usuarios navegando por este Foro: No hay usuarios registrados visitando el Foro y 1 invitado